Target
5'-nucleotidase
Ligand
BDBM26994
Substrate
Meas. Tech.
Ecto-5'-Nucleotidase Inhibition Assay
pH
7.4±n/a
Temperature
310.15±n/a K
IC50
4.21e+4± 7.8e+3 nM
Comments
extracted
Citation
 Ejaz, SASaeed, ASiddique, MNNisa, ZUKhan, SLecka, JSévigny, JIqbal, J Synthesis, characterization and biological evaluation of novel chalcone sulfonamide hybrids as potent intestinal alkaline phosphatase inhibitors. Bioorg Chem 70:229-236 (2017)  
Target
Name:
5'-nucleotidase
Synonyms:
5'-NT 5NTD_HUMAN Ecto-5'-nucleotidase NT5 NTE
Type:
Enzyme
Mol. Mass.:
63371.54
Organism:
Homo sapiens (Human)
Description:
P21589
Residue:
574
  
Inhibitor
Name:
BDBM26994
Synonyms:
CHEMBL68253 sulfamic acid
Type:
Emp. Form.:
H3NO3S
Mol. Mass.:
97.094
SMILES:
NS(O)(=O)=O
: