Target
Prostaglandin G/H synthase 2
Ligand
BDBM222294
Substrate
Meas. Tech.
In Vitro COX Inhibition Assay
Kd
56.35±0.0 nM
Citation
 Singh, JSaini, VKumar, ABansal, R Synthesis, molecular docking and biological evaluation of some newer 2-substituted-4-(benzo[d][1,3]dioxol-5-yl)-6-phenylpyridazin-3(2H)-ones as potential anti-inflammatory and analgesic agents. Bioorg Chem 71:201-210 (2017)  
Target
Name:
Prostaglandin G/H synthase 2
Synonyms:
COX2 Cyclooxygenase 2 (COX-2) Cyclooxygenase-2 (COX-2 AA) Cyclooxygenase-2 (COX-2) PGH2_HUMAN PHS II Prostaglandin E synthase/G/H synthase 2 Prostaglandin-endoperoxide synthase 2
Type:
Enzyme
Mol. Mass.:
69003.89
Organism:
Homo sapiens (Human)
Description:
Recombinant Cox-2 provided by Cayman (Cayman Chemical Co.,Ann Arbor, MI).
Residue:
604
  
Inhibitor
Name:
BDBM222294
Synonyms:
4-(Benzo[d][1,3]dioxol-5-yl)-2-(2-(4-methylpiperazin-1-yl)-2-oxoethyl)-6-phenylpyridazin-3(2H)-one (12)
Type:
Small organic molecule
Emp. Form.:
C24H24N4O4
Mol. Mass.:
432.4718
SMILES:
CN1CCN(CC1)C(=O)Cn1nc(cc(-c2ccc3OCOc3c2)c1=O)-c1ccccc1
: