Target
Lysophosphatidic acid receptor 1
Ligand
BDBM251690
Substrate
Meas. Tech.
In Vitro LPA1 Receptor Assay
Temperature
298.15±n/a K
IC50
260±n/a nM
Comments
extracted
Citation
 Buffham, WCanning, HDavenport, RFarnaby, WMack, SParmar, AWright, S Amide derivatives as lysophosphatidic acid receptor antagonists US Patent  US10100018 Publication Date 10/16/2018 
Target
Name:
Lysophosphatidic acid receptor 1
Synonyms:
EDG2 LPA-1 LPAR1 Lysophosphatidic acid receptor 1 (LPA1) | Lysophosphatidic acid receptor Edg-2
Type:
Enzyme
Mol. Mass.:
41120.55
Organism:
Homo sapiens (Human)
Description:
Q92633
Residue:
364
  
Inhibitor
Name:
BDBM251690
Synonyms:
US10100018, Example 26 | US9464060, 26
Type:
Small organic molecule
Emp. Form.:
C30H24F3NO4
Mol. Mass.:
519.5111
SMILES:
OC(=O)c1ccc(CN(CCc2ccccc2)C(=O)c2ccc(Oc3ccccc3C(F)(F)F)cc2)cc1
: