Target
Cytochrome P450 144 [31-434]
Ligand
BDBM24656
Substrate
Meas. Tech.
Optical Titration Assay
pH
7±n/a
Kd
2.980e+6± 3.00e+5 nM
Comments
extracted
Citation
 Kavanagh, MEChenge, JZoufir, AMcLean, KJCoyne, AGBender, AMunro, AWAbell, C Fragment Profiling Approach to Inhibitors of the Orphan M. tuberculosis P450 CYP144A1. Biochemistry 56:1559-1572 (2017)  
Target
Name:
Cytochrome P450 144 [31-434]
Synonyms:
CP144_MYCTO cyp144
Type:
Protein
Mol. Mass.:
43963.64
Organism:
Mycobacterium tuberculosis
Description:
M. tuberculosis cytochrome P450 144 truncation (31-434 aa)
Residue:
404
  
Inhibitor
Name:
BDBM24656
Synonyms:
4-PIM 4-phenyl-1H-imidazole CHEMBL14145 US9144538, 4-Phenylimidazole
Type:
Small organic molecule
Emp. Form.:
C9H8N2
Mol. Mass.:
144.1732
SMILES:
c1nc(c[nH]1)-c1ccccc1
: