Target
Urokinase plasminogen activator surface receptor
Ligand
BDBM222356
Substrate
Meas. Tech.
Fluorescence Polarization Assay
Ki
1700±100 nM
IC50
35600±5600 nM
Citation
 Liu, DXu, DLiu, MKnabe, WEYuan, CZhou, DHuang, MMeroueh, SO Small Molecules Engage Hot Spots through Cooperative Binding To Inhibit a Tight Protein-Protein Interaction. Biochemistry 56:1768-1784 (2017)  
Target
Name:
Urokinase plasminogen activator surface receptor
Synonyms:
CD_antigen=CD87 Monocyte activation antigen Mo3 U-PAR UPAR_HUMAN Urokinase receptor (uPAR) | Urokinase-type plasminogen activator/surface receptor
Type:
Receptor
Mol. Mass.:
36979.14
Organism:
Homo sapiens (Human)
Description:
Q03405
Residue:
335
  
Inhibitor
Name:
BDBM222356
Synonyms:
IPR-1185 (9)
Type:
Small organic molecule
Emp. Form.:
C23H14BrClF2N2O3
Mol. Mass.:
519.723
SMILES:
Cc1ccc(cc1Br)N1C(C(C(=O)c2ccc(Cl)cc2)=C(O)C1=O)c1ccc(F)nc1F
: