Target
Urokinase plasminogen activator surface receptor
Ligand
BDBM222358
Substrate
Meas. Tech.
Fluorescence Polarization Assay
Ki
1700±100 nM
IC50
57800±1900 nM
Citation
 Liu, DXu, DLiu, MKnabe, WEYuan, CZhou, DHuang, MMeroueh, SO Small Molecules Engage Hot Spots through Cooperative Binding To Inhibit a Tight Protein-Protein Interaction. Biochemistry 56:1768-1784 (2017)  
Target
Name:
Urokinase plasminogen activator surface receptor
Synonyms:
CD_antigen=CD87 Monocyte activation antigen Mo3 U-PAR UPAR_HUMAN Urokinase receptor (uPAR) | Urokinase-type plasminogen activator/surface receptor
Type:
Receptor
Mol. Mass.:
36979.14
Organism:
Homo sapiens (Human)
Description:
Q03405
Residue:
335
  
Inhibitor
Name:
BDBM222358
Synonyms:
IPR-1193 (11)
Type:
Small organic molecule
Emp. Form.:
C25H17BrClNO5
Mol. Mass.:
526.763
SMILES:
Cc1ccc(cc1Br)N1C(C(C(=O)c2ccc(Cl)cc2)=C(O)C1=O)c1ccc2OCOc2c1
: