Target
Urokinase plasminogen activator surface receptor
Ligand
BDBM222379
Substrate
Meas. Tech.
Fluorescence Polarization Assay
Ki
4500±1400 nM
IC50
46900±3300 nM
Citation
 Liu, DXu, DLiu, MKnabe, WEYuan, CZhou, DHuang, MMeroueh, SO Small Molecules Engage Hot Spots through Cooperative Binding To Inhibit a Tight Protein-Protein Interaction. Biochemistry 56:1768-1784 (2017)  
Target
Name:
Urokinase plasminogen activator surface receptor
Synonyms:
CD_antigen=CD87 Monocyte activation antigen Mo3 U-PAR UPAR_HUMAN Urokinase receptor (uPAR) | Urokinase-type plasminogen activator/surface receptor
Type:
Receptor
Mol. Mass.:
36979.14
Organism:
Homo sapiens (Human)
Description:
Q03405
Residue:
335
  
Inhibitor
Name:
BDBM222379
Synonyms:
IPR-1153 (32)
Type:
Small organic molecule
Emp. Form.:
C32H25ClFNO4
Mol. Mass.:
541.997
SMILES:
COc1cccc(CCc2ccc(cc2)N2C(C(C(=O)c3ccc(Cl)cc3)=C(O)C2=O)c2cccc(F)c2)c1
: