Target
Gag-Pol polyprotein
Ligand
BDBM222418
Substrate
Meas. Tech.
HIV-1 RT In-Vitro Assay
IC50
5.462e+4±n/a nM
Citation
 Chander, STang, CRAl-Maqtari, HMJamalis, JPenta, AHadda, TBSirat, HMZheng, YTSankaranarayanan, M Synthesis and study of anti-HIV-1 RT activity of 5-benzoyl-4-methyl-1,3,4,5-tetrahydro-2H-1,5-benzodiazepin-2-one derivatives. Bioorg Chem 72:74-79 (2017)  
Target
Name:
Gag-Pol polyprotein
Synonyms:
HIV-1 reverse transcriptase (HIV-1 RT) POL_HV1H2 Protease Reverse transcriptase (RT) gag-pol p66 RT
Type:
Protein
Mol. Mass.:
162074.74
Organism:
Human immunodeficiency virus type 1 group M subtype B (isolate HXB2)
Description:
P04585
Residue:
1435
  
Inhibitor
Name:
BDBM222418
Synonyms:
5-(4-methoxybenzoyl)-4-methyl-1,3,4,5-tetrahydro-2H-1,5-benzodiazepin-2-one (A6)
Type:
Small organic molecule
Emp. Form.:
C18H18N2O3
Mol. Mass.:
310.3471
SMILES:
COc1ccc(cc1)C(=O)N1C(C)CC(=O)Nc2ccccc12
: