Target
Prostaglandin G/H synthase 1
Ligand
BDBM222461
Substrate
Meas. Tech.
Cyclooxygenase Inhibition Assay
IC50
4.52e+3±n/a nM
Citation
 Abdellatif, KRAFadaly, WAA New 1,2-diaryl-4-substituted-benzylidene-5-4H-imidazolone derivatives: Design, synthesis and biological evaluation as potential anti-inflammatory and analgesic agents. Bioorg Chem 72:123-129 (2017)  
Target
Name:
Prostaglandin G/H synthase 1
Synonyms:
COX1 Cyclooxygenase-1 (COX-1) PTGS1 | Prostaglandin G/H synthase (cyclooxygenase)
Type:
Protein
Mol. Mass.:
68868.60
Organism:
Ovis aries (Sheep)
Description:
Residue:
600
  
Inhibitor
Name:
BDBM222461
Synonyms:
(E)-4-[2-(4-Chloro-phenyl)-4-(4-nitrobenzylidene)-5-oxo-4,5-dihydroimidazol-1-yl]-benzene-sulfonamide (10e)
Type:
Small organic molecule
Emp. Form.:
C22H15ClN4O5S
Mol. Mass.:
482.896
SMILES:
NS(=O)(=O)c1ccc(cc1)N1C(=O)\C(=C/c2ccc(cc2)[N+]([O-])=O)N=C1c1ccc(Cl)cc1
: