Target
Tyrosine-protein kinase ABL1 [64-515]
Ligand
BDBM222496
Substrate
Meas. Tech.
Radiometric Filter-Binding Assay
pH
7.5±n/a
Temperature
298.15±n/a K
IC50
3.4±n/a nM
Comments
extracted
Citation
 Furet, PGrotzfeld, RMJahnke, WJones, DBManley, PWMarzinzik, AMoussaoui, SPelle, XFSalem, BSchoepfer, J Compounds and compositions for inhibiting the activity of ABL1, ABL2 and BCR-ABL1 US Patent  US9315489 Publication Date 4/19/2016 
Target
Name:
Tyrosine-protein kinase ABL1 [64-515]
Synonyms:
ABL ABL1_HUMAN Tyrosine-protein kinase ABL1 Tyrosine-protein kinase ABL1 (ABL) | Tyrosine-protein kinase ABL1 (ABL1)
Type:
Enzyme Catalytic Domain
Mol. Mass.:
51539.77
Organism:
Homo sapiens (Human)
Description:
aa 64-515
Residue:
452
  
Inhibitor
Name:
BDBM222496
Synonyms:
US9315489, 32
Type:
Small organic molecule
Emp. Form.:
C20H14F4N2O3
Mol. Mass.:
406.3304
SMILES:
COc1ccc(cc1-c1ccc(F)nc1)C(=O)Nc1ccc(OC(F)(F)F)cc1
: