Target
Tyrosine-protein kinase ABL1 [64-515]
Ligand
BDBM222538
Substrate
Meas. Tech.
Radiometric Filter-Binding Assay
pH
7.5±n/a
Temperature
298.15±n/a K
IC50
8.7±n/a nM
Comments
extracted
Citation
 Furet, PGrotzfeld, RMJahnke, WJones, DBManley, PWMarzinzik, AMoussaoui, SPelle, XFSalem, BSchoepfer, J Compounds and compositions for inhibiting the activity of ABL1, ABL2 and BCR-ABL1 US Patent  US9315489 Publication Date 4/19/2016 
Target
Name:
Tyrosine-protein kinase ABL1 [64-515]
Synonyms:
ABL ABL1_HUMAN Tyrosine-protein kinase ABL1 Tyrosine-protein kinase ABL1 (ABL) | Tyrosine-protein kinase ABL1 (ABL1)
Type:
Enzyme Catalytic Domain
Mol. Mass.:
51539.77
Organism:
Homo sapiens (Human)
Description:
aa 64-515
Residue:
452
  
Inhibitor
Name:
BDBM222538
Synonyms:
US9315489, 74
Type:
Small organic molecule
Emp. Form.:
C18H12F3N3O2
Mol. Mass.:
359.302
SMILES:
FC(F)(F)Oc1ccc(NC(=O)c2cncc(c2)-c2cccnc2)cc1
: