Target
Tyrosine-protein kinase ABL1 [64-515]
Ligand
BDBM222528
Substrate
Meas. Tech.
Caliper Assay
pH
7.5±n/a
Temperature
303.15±n/a K
IC50
200±n/a nM
Comments
extracted
Citation
 Furet, PGrotzfeld, RMJahnke, WJones, DBManley, PWMarzinzik, AMoussaoui, SPelle, XFSalem, BSchoepfer, J Compounds and compositions for inhibiting the activity of ABL1, ABL2 and BCR-ABL1 US Patent  US9315489 Publication Date 4/19/2016 
Target
Name:
Tyrosine-protein kinase ABL1 [64-515]
Synonyms:
ABL ABL1_HUMAN Tyrosine-protein kinase ABL1 Tyrosine-protein kinase ABL1 (ABL) | Tyrosine-protein kinase ABL1 (ABL1)
Type:
Enzyme Catalytic Domain
Mol. Mass.:
51539.77
Organism:
Homo sapiens (Human)
Description:
aa 64-515
Residue:
452
  
Inhibitor
Name:
BDBM222528
Synonyms:
US9315489, 64
Type:
Small organic molecule
Emp. Form.:
C18H15F3N4O3
Mol. Mass.:
392.3319
SMILES:
OCCn1cc(cn1)-c1cncc(c1)C(=O)Nc1ccc(OC(F)(F)F)cc1
: