Target
Serine/threonine-protein kinase mTOR
Ligand
BDBM222582
Substrate
Meas. Tech.
mTOR Kinase Assay
pH
7.5±n/a
IC50
18±n/a nM
Comments
extracted
Citation
 Kuo, MLee, YChen, PChen, LJLu, YYHuang, YHsu, HTsai, P Pyrimidine compounds as mTOR and PI3K inhibitors US Patent  US9315491 Publication Date 4/19/2016 
Target
Name:
Serine/threonine-protein kinase mTOR
Synonyms:
FK506-binding protein 12-rapamycin complex-associated protein 1 FRAP FRAP1 MTOR Mammalian Target of Rapamycin (mTOR) RAFT1 Rapamycin and FKBP12 target 1 Serine/threonine-protein kinase (mTOR) | mTORC2
Type:
Rapamycin target protein
Mol. Mass.:
288917.12
Organism:
Homo sapiens (Human)
Description:
P42345
Residue:
2549
  
Inhibitor
Name:
BDBM222582
Synonyms:
US9315491, MTR-0244 | US9801888, Compound MTR-0244
Type:
Small organic molecule
Emp. Form.:
C27H30N6O6
Mol. Mass.:
534.5637
SMILES:
CCOC(=O)c1nc(nc(N2CCOCC2)c1OCC)-c1ccc(NC(=O)Nc2ccc(cc2)C(N)=O)cc1
: