Target
Tyrosine-protein kinase SYK [2-635]
Ligand
BDBM222954
Substrate
Meas. Tech.
Chip Based Microfluidic Mobility Shift Assay
pH
7.5±n/a
Temperature
303.15±n/a K
IC50
32±n/a nM
Comments
extracted
Citation
 Buehlmayer, PSmith, ABThoma, GVan Eis, M Bicyclic heteroaryl cycloalkyldiamine derivatives US Patent  US9315500 Publication Date 4/19/2016 
Target
Name:
Tyrosine-protein kinase SYK [2-635]
Synonyms:
KSYK_HUMAN Tyrosine-protein kinase SYK | Tyrosine-protein kinase SYK (SYK)
Type:
Protein
Mol. Mass.:
71948.80
Organism:
Homo sapiens (Human)
Description:
Human Syk (2-635 aa) (UniProtKB: P43405)
Residue:
634
  
Inhibitor
Name:
BDBM222954
Synonyms:
US9315500, 3.4
Type:
Small organic molecule
Emp. Form.:
C20H21N7O2
Mol. Mass.:
391.4264
SMILES:
N[C@H]1COCC[C@H]1Nc1cc2cn[nH]c(=O)c2c(Nc2cccc3cc[nH]c23)n1
: