Target
Mu-type opioid receptor
Ligand
BDBM222965
Substrate
Meas. Tech.
μ-Opioid Receptor Functional Assay
pH
7.4±n/a
Temperature
298.15±n/a K
EC50
85.4±n/a nM
Comments
extracted
Citation
 Reisch, HA 1,3-dioxanomorphides and 1,3-dioxanocodides US Patent  US9315514 Publication Date 4/19/2016 
Target
Name:
Mu-type opioid receptor
Synonyms:
M-OR-1 MOR-1 MUOR1 Mu opiate receptor OPRM1 hMOP | mu-type opioid receptor isoform MOR-1
Type:
G Protein-Coupled Receptor (GPCR)
Mol. Mass.:
44789.51
Organism:
Homo sapiens (Human)
Description:
P35372
Residue:
400
  
Inhibitor
Name:
BDBM222965
Synonyms:
US9315514, 8
Type:
Small organic molecule
Emp. Form.:
C30H41NO4
Mol. Mass.:
479.6508
SMILES:
COc1ccc2C[C@H]3N(CC4CC4)CC[C@@]45[C@@H](Oc1c24)[C@@]12CC[C@@]35C[C@@H]1[C@](C)(OCO2)C(C)(C)C
: