Target
Guanine nucleotide-binding protein subunit alpha-15 [Y147C]/Metabotropic glutamate receptor 2
Ligand
BDBM222969
Substrate
Meas. Tech.
Fluorescence Laser Imaging Plate Reader (FLIPR) Based Assay
EC50
64.1±n/a nM
Citation
 Fiji, HDKelly, III, MJKern, JCLayton, MEPero, JEReif, AJRossi, MA Imidazopyridin-2-one derivatives US Patent  US9315518 Publication Date 4/19/2016 
Target
Name:
Guanine nucleotide-binding protein subunit alpha-15 [Y147C]/Metabotropic glutamate receptor 2
Synonyms:
Guanine nucleotide-binding protein subunit alpha-15/Metabotropic glutamate receptor 2 | mGluR2 and G alpha 16
Type:
Protein
Mol. Mass.:
Description:
Components:
This complex has 2 components.
Component 1
Name:
Metabotropic glutamate receptor 2
Synonyms:
GPRC1B GRM2_HUMAN Metabotropic glutamate receptor mGlu2 | metabotropic glutamate 2
Type:
Enzyme
Mol. Mass.:
95584.88
Organism:
Homo sapiens (Human)
Description:
Q14416
Residue:
872
  
Component 2
Name:
Guanine nucleotide-binding protein subunit alpha-15
Synonyms:
G protein alpha 16 G-protein subunit alpha-16 (G alpha-16) GNA15_HUMAN Guanine nucleotide-binding protein subunit alpha-15 [Y147C]
Type:
Protein
Mol. Mass.:
43577.62
Organism:
Homo sapiens (Human)
Description:
P30679
Residue:
374
  
Inhibitor
Name:
BDBM222969
Synonyms:
US9315518, 2-16
Type:
Small organic molecule
Emp. Form.:
C23H30N4O2
Mol. Mass.:
394.5099
SMILES:
Cn1c2nc(ccc2n(CC(C)(C)C)c1=O)C1=CC2CCC1CN2C(=O)C1CC1
: