Target
Coagulation factor XI
Ligand
BDBM222993
Substrate
US9315519, S-2366 (pyroGlu-Pro-Arg-pNA; CHROMOGENIX)
Meas. Tech.
In Vitro Assay
pH
7.4±n/a
Ki
<5.00±n/a nM
Comments
extracted
Citation
 Pinto, DJClark, CGOrwat, MJSmith, II, LMEwing, WR Guanidine substituted tetrahydroisoquinoline compounds as factor XIa inhibitors US Patent  US9315519 Publication Date 4/19/2016 
Target
Name:
Coagulation factor XI
Synonyms:
Coagulation factor XIa Coagulation factor XIa light chain FA11_HUMAN Factor XIa PTA | Plasma thromboplastin antecedent
Type:
Enzyme
Mol. Mass.:
70130.58
Organism:
Homo sapiens (Human)
Description:
P03951
Residue:
625
  
Inhibitor
Name:
BDBM222993
Synonyms:
US9315519, 5
Type:
Small organic molecule
Emp. Form.:
C31H35N7O5S
Mol. Mass.:
617.719
SMILES:
COC1CCN(CC1)c1cccc2C(N(CCc12)C(=O)c1nc2CCN(Cc2s1)C(N)=N)C(=O)Nc1ccc(cc1)C(O)=O
:
Substrate
Name:
BDBM13573
Synonyms:
(2S)-5-carbamimidamido-N-(4-nitrophenyl)-2-{[(2S)-1-{[(2S)-5-oxopyrrolidin-2-yl]carbonyl}pyrrolidin-2-yl]formamido}pentanamide hydrochloride Glu-Pro-Arg-pNA L-Pyroglutamyl-L-prolyl-L-arginine-p-Nitroaniline S-2366
Type:
Small organic molecule
Emp. Form.:
C22H30N8O6
Mol. Mass.:
502.5236
SMILES:
[#7]\[#6](-[#7])=[#7]/[#6]-[#6]-[#6]-[#6@H](-[#7]-[#6](=O)-[#6@@H]-1-[#6]-[#6]-[#6]-[#7]-1-[#6](=O)-[#6@@H]-1-[#6]-[#6]-[#6](=O)-[#7]-1)-[#6](=O)-[#7]-c1ccc(cc1)-[#7+](-[#8-])=O
: