Target
Intestinal-type alkaline phosphatase
Ligand
BDBM223078
Substrate
Meas. Tech.
Alkaline Phosphatase Inhibition Assay
pH
9.8±n/a
Temperature
310.15±n/a K
IC50
2460±870 nM
Comments
extracted
Citation
 Channar, PAShah, SJHassan, SNisa, ZULecka, JSévigny, JBajorath, JSaeed, AIqbal, J Isonicotinohydrazones as inhibitors of alkaline phosphatase and ecto-5'-nucleotidase. Chem Biol Drug Des 89:365-370 (2017)  
Target
Name:
Intestinal-type alkaline phosphatase
Synonyms:
ALPI Intestinal alkaline phosphatase (IAP) PPBI_BOVIN
Type:
Protein
Mol. Mass.:
57094.82
Organism:
Bos taurus (Cattle)
Description:
P19111
Residue:
533
  
Inhibitor
Name:
BDBM223078
Synonyms:
(E)-N'-(Pyridin-4'-ylmethylene)isonicotinohydrazide (3h)
Type:
Small organic molecule
Emp. Form.:
C12H10N4O
Mol. Mass.:
226.234
SMILES:
O=C(N\N=C\c1ccncc1)c1ccncc1
: