Target
Alpha-glucosidase MAL32
Ligand
BDBM223121
Substrate
Meas. Tech.
In Vitro α-Glucosidase Inhibitory Assay
pH
6.8±n/a
IC50
2560±80 nM
Comments
extracted
Citation
 Wang, GWang, JHe, DLi, XLi, JPeng, Z Synthesis, in vitro evaluation and molecular docking studies of novel coumarin-isatin derivatives as a-glucosidase inhibitors. Chem Biol Drug Des 89:456-463 (2017)  
Target
Name:
Alpha-glucosidase MAL32
Synonyms:
Alpha-glucosidase MAL32 MAL32_YEAST Maltase alpha-Glucosidase (alpha-Glu) | alpha-Glucosidase (α-Glucosidase)
Type:
Hydrolase
Mol. Mass.:
68132.36
Organism:
Saccharomyces cerevisiae
Description:
Purchased from Wako Fine Chemicals Co. Ltd.
Residue:
584
  
Inhibitor
Name:
BDBM223121
Synonyms:
(Z)-N'-(5-chloro-1-(2-fluorobenzyl)-2-oxoindolin-3-ylidene)-2-((2-oxo-2H-chromen-7-yl)oxy)acetohydrazide (5p)
Type:
Small organic molecule
Emp. Form.:
C26H17ClFN3O5
Mol. Mass.:
505.882
SMILES:
Fc1ccccc1CN1C(=O)\C(=N/NC(=O)COc2ccc3ccc(=O)oc3c2)c2cc(Cl)ccc12
: