Target
Platelet-derived growth factor receptor beta
Ligand
BDBM6146
Substrate
Poly(E:Y)
Meas. Tech.
Kinase Inhibition Assay
pH
7.4±n/a
Temperature
298.15±n/a K
IC50
50000±n/a nM
Citation
 Thompson, AMDelaney, AMHamby, JMSchroeder, MCSpoon, TACrean, SMShowalter, HDDenny, WA Synthesis and structure-activity relationships of soluble 7-substituted 3-(3,5-dimethoxyphenyl)-1,6-naphthyridin-2-amines and related ureas as dual inhibitors of the fibroblast growth factor receptor-1 and vascular endothelial growth factor receptor-2 tyrosine kinases. J Med Chem 48:4628-53 (2005)  
Target
Name:
Platelet-derived growth factor receptor beta
Synonyms:
2.7.10.1 Beta-type platelet-derived growth factor receptor CD140b antigen PDGF-R-beta PDGFR-beta Pdgfr Pdgfrb Platelet-derived growth factor receptor | Platelet-derived growth factor receptor 1
Type:
Enzyme
Mol. Mass.:
122771.00
Organism:
Mus musculus (mouse)
Description:
P05622
Residue:
1098
  
Inhibitor
Name:
BDBM6146
Synonyms:
1,6-naphthyridine 15 3-(3,5-dimethoxyphenyl)-7-N-[3-(4-methylpiperazin-1-yl)propyl]-1,6-naphthyridine-2,7-diamine
Type:
Small organic molecule
Emp. Form.:
C24H32N6O2
Mol. Mass.:
436.5499
SMILES:
COc1cc(OC)cc(c1)-c1cc2cnc(NCCCN3CCN(C)CC3)cc2nc1N
:
Substrate
Name:
Poly(E:Y)
Synonyms:
Type:
Random polymer
Mol. Mass.:
358.43
Organism:
Description:
Random copolymer of glutamic acid and tyrosine (4:1).
Residue:
3
NA