Target
Protein arginine N-methyltransferase 5
Ligand
BDBM223134
Substrate
Meas. Tech.
In Vitro Enzymatic Assay
Temperature
298.15±n/a K
IC50
3.8e+3±n/a nM
Comments
extracted
Citation
 Ji, SMa, SWang, WJHuang, SZWang, TQXiang, RHu, YGChen, QLi, LLYang, SY Discovery of selective protein arginine methyltransferase 5 inhibitors and biological evaluations. Chem Biol Drug Des 89:585-598 (2017)  
Target
Name:
Protein arginine N-methyltransferase 5
Synonyms:
72 kDa ICln-binding protein HRMT1L5 IBP72 Jak-binding protein 1 PRMT5/MEP50 complex Protein arginine methyltransferase 5 (PRMT5) SKB1 homolog Shk1 kinase-binding protein 1 homolog
Type:
Enzyme
Mol. Mass.:
72679.99
Organism:
Homo sapiens (Human)
Description:
O14744
Residue:
637
  
Inhibitor
Name:
BDBM223134
Synonyms:
2-((4′-chloro-[1,1′-biphenyl]-3-yl)methylene)hydrazinecarboxamide (9b)
Type:
Small organic molecule
Emp. Form.:
C14H12ClN3O
Mol. Mass.:
273.718
SMILES:
NC(=O)N\N=C\c1cccc(c1)-c1ccc(Cl)cc1
: