Target
Dipeptidyl peptidase 3
Ligand
BDBM223138
Substrate
Meas. Tech.
DPP III Enzyme Activity Assay
pH
7.4±0
Temperature
310.15±0 K
IC50
4.372e+5± 1.4e+4 nM
Citation
 Agic, DBrkic, HTomic, SKaracic, Z?poljarevic, MLisjak, MBe?lo, DAbramic, M Validation of flavonoids as potential dipeptidyl peptidase III inhibitors: Experimental and computational approach. Chem Biol Drug Des 89:619-627 (2017)  
Target
Name:
Dipeptidyl peptidase 3
Synonyms:
DPP3 Dipeptidyl arylamidase III Dipeptidyl peptidase III | Dipeptidyl peptidase III (DPP III)
Type:
Enzyme
Mol. Mass.:
82565.94
Organism:
Homo sapiens (Human)
Description:
Q9NY33
Residue:
737
  
Inhibitor
Name:
BDBM223138
Synonyms:
Flavanone
Type:
Small organic molecule
Emp. Form.:
C15H12O2
Mol. Mass.:
224.2546
SMILES:
O=C1C[C@H](Oc2ccccc12)c1ccccc1
: