Target
Oplophorus-luciferin 2-monooxygenase catalytic subunit
Ligand
BDBM223155
Substrate
Meas. Tech.
NanoLuc Inhibition Assay
IC50
2500±n/a nM
Citation
 Walker, JRHall, MPZimprich, CARobers, MBDuellman, SJMachleidt, TRodriguez, JZhou, W Highly Potent Cell-Permeable and Impermeable NanoLuc Luciferase Inhibitors. ACS Chem Biol 12:1028-1037 (2017)  
Target
Name:
Oplophorus-luciferin 2-monooxygenase catalytic subunit
Synonyms:
19kOLase (EC:1.13.12.13) NanoLuc luciferase (Nluc)
Type:
Enzyme
Mol. Mass.:
21528.45
Organism:
Oplophorus gracilirostris (Luminous shrimp)
Description:
Q9GV45
Residue:
196
  
Inhibitor
Name:
BDBM223155
Synonyms:
Methyl-trans-4-(4-(2-(hexyl(m-tolyl)amino)-2-oxoethyl)-4H-thieno[3,2-b]pyrrole-5carboxamido)cyclohexane-1-carboxylate (17)
Type:
Small organic molecule
Emp. Form.:
C30H39N3O4S
Mol. Mass.:
537.713
SMILES:
CCCCCCN(C(=O)Cn1c(cc2sccc12)C(=O)N[C@H]1CC[C@@H](CC1)C(=O)OC)c1cccc(C)c1
: