Target
Oplophorus-luciferin 2-monooxygenase catalytic subunit
Ligand
BDBM223173
Substrate
Meas. Tech.
NanoLuc Inhibition Assay
IC50
830±n/a nM
Citation
 Walker, JRHall, MPZimprich, CARobers, MBDuellman, SJMachleidt, TRodriguez, JZhou, W Highly Potent Cell-Permeable and Impermeable NanoLuc Luciferase Inhibitors. ACS Chem Biol 12:1028-1037 (2017)  
Target
Name:
Oplophorus-luciferin 2-monooxygenase catalytic subunit
Synonyms:
19kOLase (EC:1.13.12.13) NanoLuc luciferase (Nluc)
Type:
Enzyme
Mol. Mass.:
21528.45
Organism:
Oplophorus gracilirostris (Luminous shrimp)
Description:
Q9GV45
Residue:
196
  
Inhibitor
Name:
BDBM223173
Synonyms:
4-(2-(Ethyl(m-tolyl)amino)-2-oxoethyl)-N-(trans-4-((2-hydroxyethyl)carbamoyl)cyclohexyl)-4Hthieno[3,2-b]pyrrole-5-carboxamide (35)
Type:
Small organic molecule
Emp. Form.:
C27H34N4O4S
Mol. Mass.:
510.648
SMILES:
CCN(C(=O)Cn1c(cc2sccc12)C(=O)NC1CCC(CC1)C(=O)NCCO)c1cccc(C)c1
: