Target
Oplophorus-luciferin 2-monooxygenase catalytic subunit
Ligand
BDBM223182
Substrate
Meas. Tech.
NanoLuc Inhibition Assay
IC50
2.3±n/a nM
Citation
 Walker, JRHall, MPZimprich, CARobers, MBDuellman, SJMachleidt, TRodriguez, JZhou, W Highly Potent Cell-Permeable and Impermeable NanoLuc Luciferase Inhibitors. ACS Chem Biol 12:1028-1037 (2017)  
Target
Name:
Oplophorus-luciferin 2-monooxygenase catalytic subunit
Synonyms:
19kOLase (EC:1.13.12.13) NanoLuc luciferase (Nluc)
Type:
Enzyme
Mol. Mass.:
21528.45
Organism:
Oplophorus gracilirostris (Luminous shrimp)
Description:
Q9GV45
Residue:
196
  
Inhibitor
Name:
BDBM223182
Synonyms:
1-(2-(Ethyl(3-ethylphenyl)amino)-2-oxoethyl)-N-(trans-4-((6hydroxyhexyl)carbamoyl)cyclohexyl)-1H-indole-2-carboxamide (44)
Type:
Small organic molecule
Emp. Form.:
C32H44N4O4S
Mol. Mass.:
580.781
SMILES:
CCN(C(=O)Cn1c(cc2sccc12)C(=O)NC1CCC(CC1)C(=O)NCCCCCCO)c1cccc(CC)c1
: