Target
Enoyl-[acyl-carrier-protein] reductase [NADH]
Ligand
BDBM8726
Substrate
Meas. Tech.
Inhibition Kinetics Assay
pH
8±0
Temperature
298.15±0 K
Ki
32±0 nM
Citation
 Neckles, CEltschkner, SCummings, JEHirschbeck, MDaryaee, FBommineni, GRZhang, ZSpagnuolo, LYu, WDavoodi, SSlayden, RAKisker, CTonge, PJ Rationalizing the Binding Kinetics for the Inhibition of the Burkholderia pseudomallei FabI1 Enoyl-ACP Reductase. Biochemistry 56:1865-1878 (2017)  
Target
Name:
Enoyl-[acyl-carrier-protein] reductase [NADH]
Synonyms:
Enoyl-ACP reductase (FabI1)
Type:
Enzyme
Mol. Mass.:
27824.56
Organism:
Burkholderia pseudomallei
Description:
Q3JG55
Residue:
253
  
Inhibitor
Name:
BDBM8726
Synonyms:
5-chloro-2-(2,4-dichlorophenoxy)phenol TCL US20230414581, Compound 35
Type:
Small organic molecule
Emp. Form.:
C12H7Cl3O2
Mol. Mass.:
289.542
SMILES:
Oc1cc(Cl)ccc1Oc1ccc(Cl)cc1Cl
: