Target
Enoyl-[acyl-carrier-protein] reductase [NADH]
Ligand
BDBM190650
Substrate
Meas. Tech.
Inhibition Kinetics Assay
pH
8±0
Temperature
298.15±0 K
Ki
25±0 nM
Citation
 Neckles, CEltschkner, SCummings, JEHirschbeck, MDaryaee, FBommineni, GRZhang, ZSpagnuolo, LYu, WDavoodi, SSlayden, RAKisker, CTonge, PJ Rationalizing the Binding Kinetics for the Inhibition of the Burkholderia pseudomallei FabI1 Enoyl-ACP Reductase. Biochemistry 56:1865-1878 (2017)  
Target
Name:
Enoyl-[acyl-carrier-protein] reductase [NADH]
Synonyms:
Enoyl-ACP reductase (FabI1)
Type:
Enzyme
Mol. Mass.:
27824.56
Organism:
Burkholderia pseudomallei
Description:
Q3JG55
Residue:
253
  
Inhibitor
Name:
BDBM190650
Synonyms:
LOX inhibitor, MLS000545091 | PT91
Type:
Small organic molecule
Emp. Form.:
C18H21ClO2
Mol. Mass.:
304.811
SMILES:
CCCCCCc1ccc(Oc2ccccc2Cl)c(O)c1
: