Target
Acetylcholinesterase
Ligand
BDBM223217
Substrate
Meas. Tech.
Cholinesterases Inhibition Assay
IC50
>1.00e+5±n/a nM
Citation
 Pouramiri, BMoghimi, SMahdavi, MNadri, HMoradi, ATavakolinejad-Kermani, EFiroozpour, LAsadipour, AForoumadi, A Synthesis and anticholinesterase activity of new substituted benzo[d]oxazole-based derivatives. Chem Biol Drug Des 89:783-789 (2017)  
Target
Name:
Acetylcholinesterase
Synonyms:
ACES_ELEEL Acetylcholinesterase (EeAChE) | ache
Type:
Enzyme
Mol. Mass.:
71812.79
Organism:
Electrophorus electricus (Electric eel)
Description:
Residue:
633
  
Inhibitor
Name:
BDBM223217
Synonyms:
2-(4-((4-Phenylpiperazine-1-yl)methyl)phenyl)benzo[d]oxazole (6h)
Type:
Small organic molecule
Emp. Form.:
C24H23N3O
Mol. Mass.:
369.4589
SMILES:
C(N1CCN(CC1)c1ccccc1)c1ccc(cc1)-c1nc2ccccc2o1
: