Target
Acetylcholinesterase
Ligand
BDBM223223
Substrate
Meas. Tech.
Cholinesterases Inhibition Assay
IC50
7.76e+3± 7e+2 nM
Citation
 Pouramiri, BMoghimi, SMahdavi, MNadri, HMoradi, ATavakolinejad-Kermani, EFiroozpour, LAsadipour, AForoumadi, A Synthesis and anticholinesterase activity of new substituted benzo[d]oxazole-based derivatives. Chem Biol Drug Des 89:783-789 (2017)  
Target
Name:
Acetylcholinesterase
Synonyms:
ACES_ELEEL Acetylcholinesterase (EeAChE) | ache
Type:
Enzyme
Mol. Mass.:
71812.79
Organism:
Electrophorus electricus (Electric eel)
Description:
Residue:
633
  
Inhibitor
Name:
BDBM223223
Synonyms:
N-((4-(benzo[d]oxazol-2-yl)phenyl)methyl)-1-benzylpiperidin-4-amine (6n)
Type:
Small organic molecule
Emp. Form.:
C26H27N3O
Mol. Mass.:
397.5121
SMILES:
C(NC1CCN(Cc2ccccc2)CC1)c1ccc(cc1)-c1nc2ccccc2o1
: