Target
Interleukin-2
Ligand
BDBM160837
Substrate
Meas. Tech.
IL-2 ELISA Assay
EC50
<1000±n/a nM
Citation
 Singh, RDuncton, MZhang, JAlvarez, STso, KHolland, SYen, RKolluri, RHeckrodt, TChen, YMasuda, ELi, HPayan, DGKelley, R Protein kinase C inhibitors and uses thereof US Patent  US9682976 Publication Date 6/20/2017 
Target
Name:
Interleukin-2
Synonyms:
IL-2 IL2_HUMAN Interleukin-2 T-cell growth factor | TCGF
Type:
Enzyme
Mol. Mass.:
17630.05
Organism:
Homo sapiens (Human)
Description:
P60568
Residue:
153
  
Inhibitor
Name:
BDBM160837
Synonyms:
US9682976, 8
Type:
Small organic molecule
Emp. Form.:
C29H41F3N6O2
Mol. Mass.:
562.67
SMILES:
CC(C)N1CCC(CC1)Oc1ccc(Nc2ncc(F)c(N[C@@H]3C[C@H]4CCCN4C(C)(C)C3)n2)cc1OC(F)F
: