Target
Interleukin-2
Ligand
BDBM161720
Substrate
Meas. Tech.
IL-2 ELISA Assay
EC50
<10000±n/a nM
Citation
 Singh, RDuncton, MZhang, JAlvarez, STso, KHolland, SYen, RKolluri, RHeckrodt, TChen, YMasuda, ELi, HPayan, DGKelley, R Protein kinase C inhibitors and uses thereof US Patent  US9682976 Publication Date 6/20/2017 
Target
Name:
Interleukin-2
Synonyms:
IL-2 IL2_HUMAN Interleukin-2 T-cell growth factor | TCGF
Type:
Enzyme
Mol. Mass.:
17630.05
Organism:
Homo sapiens (Human)
Description:
P60568
Residue:
153
  
Inhibitor
Name:
BDBM161720
Synonyms:
US9682976, 168
Type:
Small organic molecule
Emp. Form.:
C21H25FN6O
Mol. Mass.:
396.4612
SMILES:
CC1(C)C[C@@H](C[C@@H]2CCCN12)Nc1nc(Nc2ccc(O)c(c2)C#N)ncc1F
: