Target
Tyrosine-protein kinase SYK
Ligand
BDBM291019
Substrate
Meas. Tech.
In Vitro Assay
pH
7.5±n/a
Temperature
298.15±n/a K
IC50
5.5±n/a nM
Comments
extracted
Citation
 Jia, ZJVenkataramani, CHuang, WMehrotra, MSong, YXu, QBauer, SMRose, JWKane, BPandey, A Inhibitors of syk and JAK protein kinases US Patent  US9579320 Publication Date 2/28/2017 
Target
Name:
Tyrosine-protein kinase SYK
Synonyms:
KSYK_HUMAN Spleen Tyrosine Kinase Tyrosine-protein kinase SYK (Syk)
Type:
Enzyme
Mol. Mass.:
72079.99
Organism:
Homo sapiens (Human)
Description:
P43405
Residue:
635
  
Inhibitor
Name:
BDBM291019
Synonyms:
(R)-2-(1-aminobutan-2-ylamino)-4-(3-(2H-1,2,3-triazol-2-yl)phenylamino)pyrimidine-5-carboxamide | US9579320, Example 469
Type:
Small organic molecule
Emp. Form.:
C17H21N9O
Mol. Mass.:
367.4083
SMILES:
CC[C@H](CN)Nc1ncc(C(N)=O)c(Nc2cccc(c2)-n2nccn2)n1
: