Target
Pancreatic alpha-amylase
Ligand
BDBM223316
Substrate
Meas. Tech.
Inhibition Assay (piHA-Dm)
pH
7±n/a
IC50
8.5±0.9 nM
Comments
extracted
Citation
 Jongkees, SACaner, STysoe, CBrayer, GDWithers, SGSuga, H Rapid Discovery of Potent and Selective Glycosidase-Inhibiting De Novo Peptides. Cell Chem Biol 24:381-390 (2017)  
Target
Name:
Pancreatic alpha-amylase
Synonyms:
1,4-alpha-D-glucan glucanohydrolase AMYP_PIG Pancreatic α-amylase
Type:
Protein
Mol. Mass.:
57088.07
Organism:
Sus scrofa (Pig)
Description:
P00690
Residue:
511
  
Inhibitor
Name:
BDBM223316
Synonyms:
YPYSCWVRH | piHA-Dm
Type:
Small organic molecule
Emp. Form.:
C59H76N16O13S2
Mol. Mass.:
1281.464
SMILES:
CC(C)[C@H](NC(=O)[C@H](Cc1c[nH]c2ccccc12)NC(=O)[C@H](CS)N1SCC(=O)N[C@@H](Cc2ccc(O)cc2)C(=O)N2CCC[C@H]2C(=O)N[C@@H](Cc2ccc(O)cc2)C(=O)N[C@@H](CO)C1=O)C(=O)N[C@@H](CCCNC(N)=N)C(=O)N[C@@H](Cc1cnc[nH]1)C(N)=O
: