Target
Lysine-specific demethylase 5B
Ligand
BDBM223321
Substrate
Meas. Tech.
AlphaScreen Assay
IC50
<1e+5±NaN nM
Citation
 Tumber, ANuzzi, AHookway, ESHatch, SBVelupillai, SJohansson, CKawamura, ASavitsky, PYapp, CSzykowska, AWu, NBountra, CStrain-Damerell, CBurgess-Brown, NARuda, GFFedorov, OMunro, SEngland, KSNowak, RPSchofield, CJLa Thangue, NBPawlyn, CDavies, FMorgan, GAthanasou, NMüller, SOppermann, UBrennan, PE Potent and Selective KDM5 Inhibitor Stops Cellular Demethylation of H3K4me3 at Transcription Start Sites and Proliferation of MM1S Myeloma Cells. Cell Chem Biol 24:371-380 (2017)  
Target
Name:
Lysine-specific demethylase 5B
Synonyms:
CT31 Histone demethylase JARID1B Jumonji/ARID domain-containing protein 1B KDM5B_HUMAN Lysine-specific demethylase 5B (KDM5Flag-5B-FL) PLU1 RBP2-H1 | Retinoblastoma-binding protein 2 homolog 1
Type:
Protein
Mol. Mass.:
175659.67
Organism:
Homo sapiens (Human)
Description:
Q9UGL1
Residue:
1544
  
Inhibitor
Name:
BDBM223321
Synonyms:
KDOAM-32
Type:
Small organic molecule
Emp. Form.:
C15H25N5O2
Mol. Mass.:
307.3913
SMILES:
CCN(CCN(C)C)C(=O)CNCc1cncc(c1)C(N)=O
: