Target
Isoform D of Beta-secretase 1 (BACE-I-432)
Ligand
BDBM223377
Substrate
Meas. Tech.
BACE1 Cell-Free Assay
pH
4.5±n/a
Temperature
310.15±n/a K
IC50
82±n/a nM
Comments
extracted
Citation
 Brodney, MABeck, EMButler, CRZhang, LO'Neill, BTBarreiro, GLaChapelle, EARogers, BN 2-amino-6-methyl-4,4a,5,6-tetrahydropyrano[3,4-d][1,3]thiazin-8a(8H)-yl-1,3-thiazol-4-yl amides US Patent  US9315520 Publication Date 4/19/2016 
Target
Name:
Isoform D of Beta-secretase 1 (BACE-I-432)
Synonyms:
BACE BACE1_HUMAN Beta-secretase 1 (BACE1) | KIAA1149
Type:
Protein
Mol. Mass.:
48152.67
Organism:
Homo sapiens (Human)
Description:
P56817-4
Residue:
432
  
Inhibitor
Name:
BDBM223377
Synonyms:
US9315520, 92 | US9605007, Example 92
Type:
Small organic molecule
Emp. Form.:
C19H22N6O2S2
Mol. Mass.:
430.547
SMILES:
CC#CCn1ccc(n1)C(=O)Nc1csc(n1)[C@]12CO[C@@H](C)C[C@H]1CSC(N)=N2
: