Target
Aldehyde dehydrogenase, dimeric NADP-preferring
Ligand
BDBM223469
Substrate
BDBM60953
Meas. Tech.
Inhibiton Assay
pH
7.5±n/a
IC50
5200±n/a nM
Comments
extracted
Citation
 Hurley, TD Regulators of aldehyde dehydrogenase ALDH3A1 and related therapeutic methods US Patent  US9320722 Publication Date 4/26/2016 
Target
Name:
Aldehyde dehydrogenase, dimeric NADP-preferring
Synonyms:
AL3A1_HUMAN ALDH3A1 Aldehyde dehydrogenase family 3 member A1 (ALDH3A1) | Aldehyde dehydrogenase family 3 member A1 (ALDH3A1) (Q122A)
Type:
Protein
Mol. Mass.:
50394.38
Organism:
Homo sapiens (Human)
Description:
Residue:
453
  
Inhibitor
Name:
BDBM223469
Synonyms:
US9320722, CB2
Type:
Small organic molecule
Emp. Form.:
C13H11F2N2O2
Mol. Mass.:
265.2349
SMILES:
O[N+](=O)c1ccccc1CNc1ccc(F)c(F)c1
:
Substrate
Name:
BDBM60953
Synonyms:
BDBM50139371 | benzaldehyde
Type:
Emp. Form.:
C7H6O
Mol. Mass.:
106.1219
SMILES:
O=Cc1ccccc1
: