Target
Aldehyde dehydrogenase, dimeric NADP-preferring
Ligand
BDBM223471
Substrate
BDBM60953
Meas. Tech.
Inhibiton Assay
pH
7.5±n/a
IC50
11700±n/a nM
Comments
extracted
Citation
 Hurley, TD Regulators of aldehyde dehydrogenase ALDH3A1 and related therapeutic methods US Patent  US9320722 Publication Date 4/26/2016 
Target
Name:
Aldehyde dehydrogenase, dimeric NADP-preferring
Synonyms:
AL3A1_HUMAN ALDH3A1 Aldehyde dehydrogenase family 3 member A1 (ALDH3A1) | Aldehyde dehydrogenase family 3 member A1 (ALDH3A1) (Q122A)
Type:
Protein
Mol. Mass.:
50394.38
Organism:
Homo sapiens (Human)
Description:
Residue:
453
  
Inhibitor
Name:
BDBM223471
Synonyms:
US9320722, CB13
Type:
Small organic molecule
Emp. Form.:
C15H19NO4
Mol. Mass.:
277.3157
SMILES:
O=C(CCN1CCOCC1)c1ccc2OCCOc2c1
:
Substrate
Name:
BDBM60953
Synonyms:
BDBM50139371 | benzaldehyde
Type:
Emp. Form.:
C7H6O
Mol. Mass.:
106.1219
SMILES:
O=Cc1ccccc1
: