Target
RAC-alpha serine/threonine-protein kinase [1-123]
Ligand
BDBM50304371
Substrate
Meas. Tech.
SPR Competitive Binding Assay
Kd
20410±n/a nM
Citation
 Mahadevan, DMeuillet, EJMash, Jr., EAGokhale, VMPowis, GZhang, S Small molecule inhibitors of the pleckstrin homology domain and methods for using same US Patent  US9320734 Publication Date 4/26/2016 
Target
Name:
RAC-alpha serine/threonine-protein kinase [1-123]
Synonyms:
AKT1 PKB RAC-alpha serine/threonine-protein kinase (Akt)
Type:
Enzyme
Mol. Mass.:
14664.42
Organism:
Homo sapiens (Human)
Description:
PLECKSTRIN HOMOLOGY DOMAIN RESIDUES 1-123 (PH Domain)
Residue:
123
  
Inhibitor
Name:
BDBM50304371
Synonyms:
CHEMBL611216 US9320734, 103
Type:
Small organic molecule
Emp. Form.:
C15H20N4O6S2
Mol. Mass.:
416.472
SMILES:
COCCOCCOCC(=O)Nc1ccc(cc1)S(=O)(=O)Nc1nncs1
: