Target
RAC-alpha serine/threonine-protein kinase [1-123]
Ligand
BDBM223478
Substrate
Meas. Tech.
SPR Competitive Binding Assay
Kd
6030±n/a nM
Citation
 Mahadevan, DMeuillet, EJMash, Jr., EAGokhale, VMPowis, GZhang, S Small molecule inhibitors of the pleckstrin homology domain and methods for using same US Patent  US9320734 Publication Date 4/26/2016 
Target
Name:
RAC-alpha serine/threonine-protein kinase [1-123]
Synonyms:
AKT1 PKB RAC-alpha serine/threonine-protein kinase (Akt)
Type:
Enzyme
Mol. Mass.:
14664.42
Organism:
Homo sapiens (Human)
Description:
PLECKSTRIN HOMOLOGY DOMAIN RESIDUES 1-123 (PH Domain)
Residue:
123
  
Inhibitor
Name:
BDBM223478
Synonyms:
US9320734, 110
Type:
Small organic molecule
Emp. Form.:
C12H14N4O3S2
Mol. Mass.:
326.395
SMILES:
CCc1nnc(NS(=O)(=O)c2ccc(NC(C)=O)cc2)s1
: