Target
Bromodomain-containing protein 4
Ligand
BDBM223492
Substrate
Meas. Tech.
Alpha Assay
pH
7.4±n/a
Temperature
298.15±n/a K
IC50
0.427±n/a nM
Comments
extracted
Citation
 Bradner, JEQi, J Compositions and methods for treating neoplasia, inflammatory disease and other disorders US Patent  US9320741 Publication Date 4/26/2016 
Target
Name:
Bromodomain-containing protein 4
Synonyms:
BRD4 Bromodomain-containing protein 4 (BRD4) Protein HUNK1
Type:
Protein
Mol. Mass.:
152264.84
Organism:
Homo sapiens (Human)
Description:
O60885
Residue:
1362
  
Inhibitor
Name:
BDBM223492
Synonyms:
US10407441, Compound JQ8 US9320741, JQ8
Type:
Small organic molecule
Emp. Form.:
C24H24ClN7OS
Mol. Mass.:
494.012
SMILES:
Cc1nnc2[C@H](CC(=O)NCCc3cnc[nH]3)N=C(c3c(C)c(C)sc3-n12)c1ccc(Cl)cc1
: