Target
Lysophosphatidic acid receptor 3
Ligand
BDBM223529
Substrate
Meas. Tech.
Calcium Flux Assay Using Fluorometric Imaging Plate Reader (FLIPR) Assay
Temperature
298.15±n/a K
IC50
>30000±n/a nM
Comments
extracted
Citation
 Gabriel, SDHamilton, MMLucas, MCQian, YSidduri, A N-alkyltriazole compounds as LPAR antagonists US Patent  US9321738 Publication Date 4/26/2016 
Target
Name:
Lysophosphatidic acid receptor 3
Synonyms:
EDG7 LPAR3 Lysophosphatidic acid receptor 1/3 Lysophosphatidic acid receptor Edg-7
Type:
Enzyme
Mol. Mass.:
40149.72
Organism:
Homo sapiens (Human)
Description:
Q9UBY5
Residue:
353
  
Inhibitor
Name:
BDBM223529
Synonyms:
US9321738, 1
Type:
Small organic molecule
Emp. Form.:
C19H18BrN3O2
Mol. Mass.:
400.269
SMILES:
C[C@@H](OC(=O)Cc1c(nnn1C)-c1ccc(Br)cc1)c1ccccc1
: