Target
Cyclin-T1/Cyclin-dependent kinase 9
Ligand
BDBM223779
Substrate
Meas. Tech.
LANCE ULight TR-FRET Kinase Assay
IC50
21±n/a nM
Citation
 Frey, RGong, JJi, ZLai, CPenning, TSong, XSouers, ATong, YZhu, G Tetracyclic CDK9 kinase inhibitors US Patent  US9328112 Publication Date 5/3/2016 
Target
Name:
Cyclin-T1/Cyclin-dependent kinase 9
Synonyms:
CDK9/ Cyclin-T1 CDK9/Cyclin T Cyclin T1/dependent kinase 9 | Cyclin-Dependent Kinase 9 (CDK9)
Type:
Protein Complex
Mol. Mass.:
Description:
Components:
This complex has 2 components.
Component 1
Name:
Cyclin-T1
Synonyms:
CCNT1 CycT Cyclin T Cyclin-T
Type:
Enzyme Subunit
Mol. Mass.:
80712.40
Organism:
Homo sapiens (Human)
Description:
Residue:
726
  
Component 2
Name:
Cyclin-dependent kinase 9
Synonyms:
C-2K CDK9 Cell division cycle 2-like protein kinase 4 Cyclin-Dependent Kinase 9 (CDK9) Serine/threonine-protein kinase PITALRE Tat-associated kinase complex catalytic subunit
Type:
Enzyme Subunit
Mol. Mass.:
42789.13
Organism:
Homo sapiens (Human)
Description:
Residue:
372
  
Inhibitor
Name:
BDBM223779
Synonyms:
US9328112, 1
Type:
Small Organic Molecule
Emp. Form.:
C20H19FN4
Mol. Mass.:
334.3901
SMILES:
CN1Cc2c([nH]c3nccc(-c4cc(F)ccc14)c23)C1=CCNCC1
: