Target
Cyclin-T1/Cyclin-dependent kinase 9
Ligand
BDBM223876
Substrate
Meas. Tech.
LANCE ULight TR-FRET Kinase Assay
IC50
73±n/a nM
Citation
 Frey, RGong, JJi, ZLai, CPenning, TSong, XSouers, ATong, YZhu, G Tetracyclic CDK9 kinase inhibitors US Patent  US9328112 Publication Date 5/3/2016 
Target
Name:
Cyclin-T1/Cyclin-dependent kinase 9
Synonyms:
CDK9/ Cyclin-T1 CDK9/Cyclin T Cyclin T1/dependent kinase 9 | Cyclin-Dependent Kinase 9 (CDK9)
Type:
Protein Complex
Mol. Mass.:
Description:
Components:
This complex has 2 components.
Component 1
Name:
Cyclin-T1
Synonyms:
CCNT1 CycT Cyclin T Cyclin-T
Type:
Enzyme Subunit
Mol. Mass.:
80712.40
Organism:
Homo sapiens (Human)
Description:
Residue:
726
  
Component 2
Name:
Cyclin-dependent kinase 9
Synonyms:
C-2K CDK9 Cell division cycle 2-like protein kinase 4 Cyclin-Dependent Kinase 9 (CDK9) Serine/threonine-protein kinase PITALRE Tat-associated kinase complex catalytic subunit
Type:
Enzyme Subunit
Mol. Mass.:
42789.13
Organism:
Homo sapiens (Human)
Description:
Residue:
372
  
Inhibitor
Name:
BDBM223876
Synonyms:
US9328112, 98
Type:
Small Organic Molecule
Emp. Form.:
C29H32FN5O2
Mol. Mass.:
501.5951
SMILES:
CN(C1CC(O)C1)C(=O)CN1[C@H]2CC[C@@H]1C=C(C2)c1[nH]c2nccc3-c4cc(F)ccc4N(C)Cc1c23
: