Target
Beta-secretase 2
Ligand
BDBM291108
Substrate
Meas. Tech.
BACE-2 Assay
pH
5±n/a
Ki
728±n/a nM
Comments
extracted
Citation
 Cumming, JNScott, Jr., JDStamford, AWIserloh, UNeelamkavil, SFShao, PPWilson, JE C6-spiro iminothiadiazine dioxides as BACE inhibitors, compositions, and their use US Patent  US9580396 Publication Date 2/28/2017 
Target
Name:
Beta-secretase 2
Synonyms:
AEPLC ASP1 Asp 1 Aspartyl protease 1 BACE2_HUMAN Beta-secretase (BACE) Beta-secretase 2 (BACE-2) Beta-site APP-cleaving enzyme 2 Memapsin-1 beta-Secretase (BACE-2)
Type:
Protein
Mol. Mass.:
56171.20
Organism:
Homo sapiens (Human)
Description:
Q9Y5Z0
Residue:
518
  
Inhibitor
Name:
BDBM291108
Synonyms:
US9580396, Example 1d
Type:
Small organic molecule
Emp. Form.:
C14H16F2N4O4S
Mol. Mass.:
374.363
SMILES:
CN1C(=N)N[C@@]2(CCOc3ccc(NC(=O)C(F)F)cc23)CS1(=O)=O
: