Target
Beta-secretase 1
Ligand
BDBM291160
Substrate
Meas. Tech.
HTRF FRET Assay
pH
5±n/a
Ki
20.0±n/a nM
Comments
extracted
Citation
 Cumming, JNScott, Jr., JDStamford, AWIserloh, UNeelamkavil, SFShao, PPWilson, JE C6-spiro iminothiadiazine dioxides as BACE inhibitors, compositions, and their use US Patent  US9580396 Publication Date 2/28/2017 
Target
Name:
Beta-secretase 1
Synonyms:
ASP2 Aspartyl protease 2 BACE1 Beta-secretase (BACE) Beta-secretase 1 (BACE 1) Beta-secretase 1 (BACE1) Beta-site amyloid precursor protein cleaving enzyme 1 Memapsin-2 beta-Secretase (BACE-1) | beta-Secretase (BACE1)
Type:
Protein
Mol. Mass.:
55755.10
Organism:
Homo sapiens (Human)
Description:
P56817
Residue:
501
  
Inhibitor
Name:
BDBM291160
Synonyms:
US9580396, Example 5w
Type:
Small organic molecule
Emp. Form.:
C18H20F2N6O3S
Mol. Mass.:
438.452
SMILES:
CN1C(=N)N[C@@]2(CCCc3ccc(NC(=O)c4ccn(n4)C(F)F)cc23)CS1(=O)=O
: