Target
FMN_red domain-containing protein
Ligand
BDBM4706
Substrate
Meas. Tech.
Sialidase Assay
pH
9±n/a
Ki
2.010e+6±n/a nM
Comments
extracted
Citation
 Hayre, JKXu, GBorgianni, LTaylor, GLAndrew, PWDocquier, JDOggioni, MR Optimization of a direct spectrophotometric method to investigate the kinetics and inhibition of sialidases. BMC Biochem 13:19 (2012)  
Target
Name:
FMN_red domain-containing protein
Synonyms:
Neuraminidase C (NanC)
Type:
Enzyme
Mol. Mass.:
45822.72
Organism:
Streptococcus pneumoniae
Description:
spr1326
Residue:
414
  
Inhibitor
Name:
BDBM4706
Synonyms:
(2R,3R,4S)-3-acetamido-4-hydroxy-2-[(1R,2R)-1,2,3-trihydroxypropyl]-3,4-dihydro-2H-pyran-6-carboxylic acid CHEMBL96712 Neu5Ac2en
Type:
Small organic molecule
Emp. Form.:
C11H17NO8
Mol. Mass.:
291.2546
SMILES:
CC(=O)N[C@@H]1[C@@H](O)C=C(O[C@H]1[C@H](O)[C@H](O)CO)C(O)=O
: