Target
Lactoylglutathione lyase
Ligand
BDBM224012
Substrate
Meas. Tech.
GLO1 Activity Assay
pH
7±0
Temperature
298.15±0 K
IC50
4.28e+4± 2.2e+3 nM
Citation
 Li, JYakushi, TParlati, FMackinnon, ALPerez, CMa, YCarter, KPColayco, SMagnuson, GBrown, BNguyen, KVasile, SSuyama, ESmith, LHSergienko, EPinkerton, ABChung, TDYPalmer, AEPass, IHess, SCohen, SMDeshaies, RJ Capzimin is a potent and specific inhibitor of proteasome isopeptidase Rpn11. Nat Chem Biol 13:486-493 (2017)  
Target
Name:
Lactoylglutathione lyase
Synonyms:
Aldoketomutase Glx I Glyoxalase I LGUL_HUMAN S-D-lactoylglutathione methylglyoxal lyase
Type:
Enzyme
Mol. Mass.:
20772.95
Organism:
Homo sapiens (Human)
Description:
Q04760
Residue:
184
  
Inhibitor
Name:
BDBM224012
Synonyms:
Capzimin | US10005735, Compound 12
Type:
Small organic molecule
Emp. Form.:
C15H13N3OS2
Mol. Mass.:
315.413
SMILES:
Sc1cccc2cc(cnc12)C(=O)NCCc1nccs1
: