Target
Mas-related G-protein coupled receptor member X2
Ligand
BDBM50037483
Substrate
Meas. Tech.
PRESTO-Tango Assay
pH
7.4±0
Temperature
303.15±0 K
EC50
1.4e+4±4.5e+3 nM
Citation
 Lansu, KKarpiak, JLiu, JHuang, XPMcCorvy, JDKroeze, WKChe, TNagase, HCarroll, FIJin, JShoichet, BKRoth, BL In silico design of novel probes for the atypical opioid receptor MRGPRX2. Nat Chem Biol 13:529-536 (2017)  
Target
Name:
Mas-related G-protein coupled receptor member X2
Synonyms:
MRGPRX2 MRGX2_HUMAN Mas-related G-protein coupled receptor member X2
Type:
GPCR
Mol. Mass.:
37104.79
Organism:
Homo sapiens (Human)
Description:
Q96LB1
Residue:
330
  
Inhibitor
Name:
BDBM50037483
Synonyms:
(+)-cis-N-Normetazocine CHEMBL114203
Type:
Small organic molecule
Emp. Form.:
C14H19NO
Mol. Mass.:
217.3068
SMILES:
C[C@H]1C2Cc3ccc(O)cc3[C@@]1(C)CCN2
: