Target
Serine/threonine-protein kinase pim-3
Ligand
BDBM225042
Substrate
Meas. Tech.
Enzyme Assay
IC50
0.586±n/a nM
Citation
 Wang, HCee, VJHerberich, BJJackson, CLLanman, BANixey, TPettus, LHReed, ABWu, BWurz, RTasker, A Azole compounds as PIM inhibitors US Patent  US9321756 Publication Date 4/26/2016 
Target
Name:
Serine/threonine-protein kinase pim-3
Synonyms:
PIM3 Serine/threonine-protein kinase pim-3 (PIM3)
Type:
Protein
Mol. Mass.:
35888.19
Organism:
Homo sapiens (Human)
Description:
Q86V86
Residue:
326
  
Inhibitor
Name:
BDBM225042
Synonyms:
US9321756, 4
Type:
Small organic molecule
Emp. Form.:
C19H19N7O
Mol. Mass.:
361.4005
SMILES:
Nc1nnc(o1)-c1ccc2[nH]cc(-c3cncc(NC4CCCC4)n3)c2c1
: