Target
Ribosomal protein S6 kinase beta-1
Ligand
BDBM224340
Substrate
Meas. Tech.
Enzyme Assay
pH
7.5±n/a
IC50
1.7±n/a nM
Comments
extracted
Citation
 Lan, RHuck, BRChen, XDeselm, LCQiu, HXiao, YNeagu, CMochalkin, IJohnson, TL Aminopyrimidine derivatives for use as modulators of kinase activity US Patent  US9321760 Publication Date 4/26/2016 
Target
Name:
Ribosomal protein S6 kinase beta-1
Synonyms:
70 kDa ribosomal protein S6 kinase 1 70 kDa ribosomal protein kinase (p70S6K) Protein kinase 70S6K (T412E) RPS6KB1 Ribosomal protein S6 kinase I STK14A p70S6K1
Type:
Enzyme
Mol. Mass.:
59139.89
Organism:
Homo sapiens (Human)
Description:
His-tagged S6K1.
Residue:
525
  
Inhibitor
Name:
BDBM224340
Synonyms:
US10080750, Compound 17 US9662330, Compound 17
Type:
Small organic molecule
Emp. Form.:
C25H28F4N6
Mol. Mass.:
488.5236
SMILES:
CN(C)C[C@H](N1CCN(CC1)c1ncnc(N)c1-c1ccc(F)cc1)c1ccc(cc1)C(F)(F)F
: